{"text_format":"1","workbook":"xlsx","n_sheets":6,"sheets":["Input og resultat","IDF","Kommuneliste","Tables","help1","help3"],"not_rendered":{"charts":0,"images":4,"macros":1,"external_links":0,"defined_names":45,"comments":0,"pivot_tables":0},"unopened":[],"bounds":{"document_bytes":16777216,"sheet_cells":100000,"rows_first":2000,"rows_last":500,"rows_between":2000,"halvings":0,"cell_chars":16384,"cell_head_chars":4096},"cells_cut":0,"cells_raw":0,"read":"whole","date_system":"1900"}

{"sheet":"Input og resultat","index":0,"n_rows":54,"n_cols":14,"rows_kept":54,"cut":false,"hidden":false,"merged":[[0,11,0,13],[1,11,1,13],[2,11,2,13]]}
["Nedbørskarakteristika",null,null,null,null,null,null,null,"Pil ikke - intern beregning",null,null,"Jord- og nedsivningskarakteristika"]
["Kommune","Solrød",null,null,null,null,null,null,"Afskærende lednings kapacitet l/s",40,null,"Ved indtastning af og beregning af K-værdi, benyttes en af to følgende metoder;"]
[null," ",null,null,null,null,null,null,"Volumen m³",{"$f":"IDF!M15","v":0.11813981038349158},null,"Hvis nedsivningstest benyttes, skal K-indtastet sættes til 1, benyttes k-indtastet skal synketest sættes til 500 cm og 0,05 min"]
["Designkarakteristika",null,null,null,null,null,null,null,"Total opland (m²)",1000,null,"Nedsivningstest"]
["Gentagelsesperiode (år)",5,"år",null,null,null,null,null,null,null,null,"Vandet er sunket antal cm",40,"cm"]
["Sikkerhedsfaktor (klima, fremtidig udbygning, etc)",1.25,null,null,null,"Beregningstjek","Vol m³","Dræn kap l/s","Iterationsafstand","Antal iterationer",null,"på antal minutter",5,"min"]
["Oplandskarakteristika",null,null,null,"Faskine",{"$f":"IF(ABS((H7-B20)/H7)<0.001,\"OK\",\"Beregn\")","v":"OK"},2.1482310563015954,1.0384934061923432,8.7653349995354003E-4,21,null,"K (Hydraulisk  ledningsevne) udregnet",{"$f":"((M5/100)/(M6*60))","v":1.3333333333333335E-3},"m/s"]
["Befæstet areal (m²)",172,"m²",null,"Regnbed",{"$f":"IF(ABS((H8-B26)/H8)<0.001,\"OK\",\"Beregn\")","v":"OK"},2.718894822840193,0.8,0,1]
[null,null,null,null,"Grøft",{"$f":"IF(ABS((H9-B35)/H9)<0.001,\"OK\",\"Beregn\")","v":"OK"},1.6708656930554293,2.5054787882314655,3.9343658385587096E-5,2]
["Jord- og nedsivningskarakteristika ",null,null,null,"Perm. bel.",{"$f":"IF(ABS((H10-B44)/H10)<0.001,\"OK\",\"Beregn\")","v":"OK"},0.11813981038349158,40,0,1,null,"K (Hydraulisk  ledningsevne) indtastet",1E-4,"m/s"]
["K (Hydraulisk  ledningsevne) - se evt måling nederst ",{"$f":"MIN(M7,M10)","v":1E-4},"m/s"]
[]
[]
["Faskine",null,null,null,"Hjælpestørrelser, faskine",null,null,null,"Dimensionerende kasseregn, Afløbsteknik s. 269"]
["Bredde",0.5,"m",null,"Opstuvningsvolumen",null,{"$f":"F_bredde*F_hojde*F_hulrum*F_laengde","v":2.1482310563015954}," [m³]","Vr,k (mm)",10.408096203011604]
["Højde",0.4,"m",null,"Faskine volumen ",null,{"$f":"G15/F_hulrum","v":2.2612958487385217}," [m³]","Varighed (h)",0.25190891670608057]
["Hulrums andel i faskine [Plast: 0,95, sten: 0,25]",0.95,"0-1",null,"Regn, der holdes umiddelbart",null,{"$f":"G15/B8*1000","v":12.489715443613926}," [mm]"]
["Udsivning i faskinebund: 0=Nej ,1=ja",1,null,null,"Regn, der siver pr døgn ",null,{"$f":"B20*86400/B8","v":521.204549993917}," [mm/døgn]","Karakteritika for dimensionerende kasseregn"]
["Længde faskine",{"$f":"G7/(B15*B16*B17)","v":11.306479243692607},"m",null,"Tømmetid",{"$f":"ROUND(G19/60/60,0)","v":1},{"$f":"G15/(B20/1000)","v":2070.4182539097897}," [s]","Samlet nedbør (mm)",{"$f":"J15+G18/24*J16","v":15.87876593514693}]
["Dræn kapacitet, gennemsnit",{"$f":"((B19+B15)*B16+B18*B19*B15)*B11*1000","v":1.0375831319323348},"l/s",null,"Afløbstal ",null,{"$f":"B20/B8*10000","v":60.324600693740393},"[l/sek/ha]","Intensitet (l/sek/ha)",{"$f":"J19*10000/(J16*3600)","v":175.09377488471114}]
{"$rows_left_out":35}
{"sheet":"IDF","index":1,"n_rows":69,"n_cols":35,"rows_kept":69,"cut":false,"hidden":false,"merged":[]}
[null,null,null,null,null,null,null,null,null,null,null,null,"Bassindimensionering opstrøms udløb",null,null,null,null,null,null,"Regression",null,null,null,null,null,null,null,null,null,"Sæt optimering i gang"]
[null,null,null,null,null,null,null,null,null,null,null,null,"Oplandskarakteristika",null,null,null,null,null,null,null,null,null,null,null,null,null,null,null,null,"Initdummy"]
[null,null,null,null,null,null,null,null,null,null,null,null,"Befæstet areal (ha)",null,null,null,{"$f":"'Input og resultat'!J4/10000","v":0.1},null,null,"Estimates, 3 parameters:",null,null,null,null,null,null,null,null,null,{"$f":"initdummy(B3,B4,B8,B9,B10,I3,I4,I5,Q3,Q4,Q5)","v":1}]
[null,null,null,null,null,null,null,null,null,null,null,null,"Hydrologisk reduktionsfaktor (-)",null,null,null,1,null,null,"Alpha",{"$f":"EXP(X22/10+U7*W22/10)","v":164.01796437482628}]
["Årsmiddelnedbør [mm]",{"$f":"VLOOKUP('Input og resultat'!B2,Kommuneliste!A3:C101,2,FALSE)","v":632.98455454861198},"Fås fra kommunelisten",null,null,null,null,null,null,null,null,null,"Afskærende lednings kapacitet (l/s)",null,null,null,{"$f":"'Input og resultat'!J2","v":40},null,null,"Theta",{"$f":"AD11","v":4.6032724076538081},null,null,null,null,null,null,null,null,"idftheta","theta"]
["Middelværdi Klimagrid [mm/dag]",{"$f":"VLOOKUP('Input og resultat'!B2,Kommuneliste!A3:C101,3,FALSE)","v":28.074318438083001},"Fås fra kommunelisten"]
[null,null,null,null,null,null,null,null,null,null,null,null,null,null,null,null,null,null,null,"Nu",{"$f":"-(Z22-W22*X22/10)/(Y22-W22^2/10)","v":0.75026682346518547},null,null,null,null,null,null,null,null,{"$f":"idftheta(AE7)","v":0.10891390193970893},1]
["Gentagelsesperiode (år)",{"$f":"'Input og resultat'!B5","v":5},{"$f":"IF(B8<1/help1!C11,CONCATENATE(\" Fejl: Indtast gentagelsesperiode > \",ROUND(1/help1!C11,2),\" år\"),\" \")","v":" "},null,null,null,null,null,null,null,null,null,"NB. Frekvens- og sikkerhedsfaktorer på regnen ",null,null,null,null,null,null,null,null,null,null,null,null,null,null,null,null,"derividf","x"]
["Sikkerhedsfaktor (Fra Skrift 27)",{"$f":"'Input og resultat'!B6","v":1.25},"Defineret i Skrift 27, Faktor til beskrivelse af usikkerhed, klima, mv. Typisk 1.0 - 1.8",null,null,null,null,null,null,null,null,null,"indgår ved beregning af bassinvolumen",null,null,null,null,null,null,"Dur (min)","Intensity","ln(dur)","ln(dur+Theta)","ln(int)","ln(dur+Theta)^2","ln(dur+Theta)*ln(int)","Est. Intensity","Obj.Func",null,{"$f":"derividf(AE9)","v":-8.7667667708624109E-2},{"$f":"AE7","v":1}]
[null,null,null,null,null,null,null,null,null,null,null,null,null,null,null,null,null,null,null,null,null,null,null,null,null,null,null,null,null,"bisectidf","min","max","middel","tiny"]
[null,null,null,null,null,null,null,null,null,null,null,null,null,null,null,null,null,null,null,{"$f":"IDF!A19","v":2},{"$f":"IDF!D19","v":39.456819281517085},{"$f":"LN(T11)","v":0.69314718055994529},{"$f":"LN(T11+$U$5)","v":1.8875653454960712},{"$f":"LN(U11)","v":3.6752068912005886},{"$f":"W11^2","v":3.5629029335177029},{"$f":"W11*X11","v":6.9371931653585808},{"$f":"$U$4*(T11+$U$5)^(-$U$7)","v":39.797269517453351},{"$f":"(LN(U11)-LN(AA11))^2","v":7.3812388458234076E-5},null,{"$f":"bisectidf(AE11,AF11,AG11,AH11)","v":4.6032724076538081},0,60,{"$f":"(AE11+AF11)/2","v":30},{"$f":"AD3/100000","v":1.0000000000000001E-5}]
[null,null,null,null,null,null,null,null,null,null,null,null,null,null,null,null,null,null,null,{"$f":"IDF!A20","v":5},{"$f":"IDF!D20","v":30.219754342064753},1.6094379124341003,2.2621039161861072,3.4084958278262705,5.1171141276245224,7.7103717604298136,30.047950064027116,3.2505810020503005E-5]
[null,null,null,null,null,null,null,null,null,null,null,null,null,null,null,null,null,null,null,{"$f":"IDF!A21","v":10},{"$f":"IDF!D21","v":22.320247287993542},2.3025850929940459,2.6812456411097667,3.1054942166629163,7.1890781879701242,8.326592831919033,21.940325937877983,2.9473699821267022E-4]
["Design regnkurve",null,null,null,null,null,null,null,null,null,null,null,"Volumen af bassin",null,null,null,null,null,null,{"$f":"IDF!A22","v":30},{"$f":"IDF!D22","v":11.440307260202065},3.4011973816621555,3.5439482558473276,2.4371428440002427,12.559569240123317,8.6371081312454567,11.485313821754245,1.5415959344835418E-5]
[null,null,null,null,null,null,null,null,null,null,null,null,{"$f":"Q24*Q27*12","v":0.11813981038349158},"m3",{"$f":"IF(Y27>0.1,\"ADVARSEL: Programmet har muligvis ikke optimeret korrekt\",\" \")","v":" "},null,null,null,null,{"$f":"IDF!A23","v":60},{"$f":"IDF!D23","v":7.0202384146655454},4.0943445622221004,4.1682650659707896,1.9487971796640864,17.374433660192469,8.1231032046562124,7.189811614088411,5.6967142933096347E-4]
["Varighed","zT","S{zT}","f*zT","Regression",null,null,null,null,null,null,null,"Effekten af koblede regn ER inkluderet (20 % ekstra volumen)",null,null,null,null,null,null,{"$f":"IDF!A24","v":180},{"$f":"IDF!D24","v":3.248796965691648},5.1929568508902104,5.2182090489303397,1.1782847634113223,27.22970567833848,6.148536214649706,3.2704475251136174,4.4117093440830626E-5]
["(min)","(mm/s)","(mm/s)","(mm/s)","(mm/s)",null,null,null,null,null,null,null,null,null,null,null,null,null,null,{"$f":"IDF!A25","v":360},{"$f":"IDF!D25","v":1.9826306480317835},5.8861040314501558,5.898809837540691,0.68442457300206283,34.79595749946683,4.0372904042791546,1.9626481173970365,1.0261550900899028E-4]
[null,null,null,null,null,null,null,null,null,null,null,null,null,null,null,null,null,null,null,{"$f":"IDF!A26","v":720},{"$f":"IDF!D26","v":1.195817120491129},6.5792512120101012,6.5856242946081816,0.1788297345482692,43.37044734973351,1.1777054444394137,1.1723385804999056,3.931969308410201E-4]
[2,{"$f":"help1!B18","v":31.565455425213671},{"$f":"help1!C18","v":1.5629627168561984},{"$f":"$B$9*B19","v":39.456819281517085},{"$f":"IDF!$U$4*(A19+IDF!$U$5)^(-IDF!$U$7)","v":39.797269517453351},null,null,null,null,null,null,null,null,null,null,null,null,null,null,{"$f":"IDF!A27","v":1440},{"$f":"IDF!D27","v":0.70562640418328848},7.2723983925700466,7.2755900108832199,-0.34866935409501648,52.934210006463694,-2.5367752697548061,0.69861334408965026,9.9769962629849611E-5]
[5,{"$f":"help1!B19","v":24.175803473651804},{"$f":"help1!C19","v":1.0606085220232371},30.219754342064753,{"$f":"IDF!$U$4*(A20+IDF!$U$5)^(-IDF!$U$7)","v":30.047950064027116},null,null,null,null,null,null,null,null,null,null,null,null,null,null,{"$f":"IDF!A28","v":2880},{"$f":"IDF!D28","v":0.40767044223570537},7.965545573129992,7.9671426555894698,-0.89729617059376465,63.47536209451323,-7.1488865954346679,0.41581831720479245,3.916171459620141E-4]
{"$rows_left_out":50}
{"sheet":"Kommuneliste","index":2,"n_rows":101,"n_cols":6,"rows_kept":101,"cut":false,"hidden":false,"merged":[]}
[null,"Årsmiddelnedbør","Middelværdi Klimagrid","Northing","Easting","Faskinebund"]
["Kommuner","mm","mm/dag","m","m","Nej/ja"]
["Albertslund",640.93120613344104,27.883887816645199,6175140,710791,0]
["Allerød",685.90148109916402,27.980664954474399,6195096,707641,1]
["Assens",715.00320983031304,25.8390130749906,6126050,565439]
["Ballerup",658.35836399584298,28.203187564974399,6181137,710019]
["Billund",888.55226207130499,26.431787823322999,6177641,498323]
["Bornholm",694.85653734071695,28.977950787728101,6126753,877619]
["Brøndby",637.69404606863304,27.704196220811799,6171287,714637]
["Brønderslev",756.59296932385598,27.067365368482601,6340900,565980]
["Christiansø",575.92674548849095,29.351724032698002,6148265,892218]
["Dragør",608.69892604858796,26.9475763886701,6164631,729202]
["Egedal",640.48044867487999,28.322975651501402,6184288,702479]
["Esbjerg",836.22271448582501,25.106513539742998,6140331,475667]
["Fanø",806.00790372292499,25.148578761261501,6140167,463990]
["Favrskov",670.50951171173097,24.9798061927643,6241884,558870]
["Faxe",650.68927764681098,26.784458755737699,6128922,694309]
["Fredensborg",722.50273138104399,27.484682690605101,6205785,715168]
["Fredericia",745.09731787026499,24.8424444364599,6158304,544664]
["Frederiksberg",639.26087634107103,26.930061600356002,6176349,721564]
{"$rows_left_out":82}
{"sheet":"Tables","index":3,"n_rows":47,"n_cols":12,"rows_kept":47,"cut":false,"hidden":true,"merged":[]}
["LAMBDA"]
[]
["Variabel","b_0","b_1","V(b_0)","Cov","V(b_1)","Res.var.",null,"E(lambda)","V(lambda)",null,"z_0"]
["i1m",0.41959999999999997,5.8669999999999998E-3,1.018,-1.4239999999999999E-3,2.052E-6,0.25850000000000001,null,{"$f":"B4+C4*IDF!$B$5","v":4.1333203815367066},{"$f":"D4+2*E4*IDF!$B$5+F4*IDF!$B$5^2+G4","v":0.29593369244721229},null,16.7]
["i2m",0.82350000000000001,3.5630000000000002E-3,0.47949999999999998,-6.5200000000000002E-4,9.3379999999999996E-7,7.1230000000000002E-2,null,{"$f":"B5+C5*IDF!$B$5","v":3.0788239678567049},{"$f":"D5+2*E5*IDF!$B$5+F5*IDF!$B$5^2+G5","v":9.9463269820846342E-2},null,14.9]
["i5m",1.476,2.3579999999999999E-3,0.42599999999999999,-5.7839999999999996E-4,8.2880000000000001E-7,5.9540000000000003E-2,null,{"$f":"B6+C6*IDF!$B$5","v":2.9685775796256268},{"$f":"D6+2*E6*IDF!$B$5+F6*IDF!$B$5^2+G6","v":8.53783043892061E-2},null,10.6]
["i10m",1.849,1.6169999999999999E-3,0.48909999999999998,-6.7159999999999995E-4,9.6059999999999996E-7,7.8719999999999998E-2,null,{"$f":"B7+C7*IDF!$B$5","v":2.8725360247051057},{"$f":"D7+2*E7*IDF!$B$5+F7*IDF!$B$5^2+G7","v":0.10247821644330322},null,7.34]
["i30m",1.825,1.6080000000000001E-3,0.42620000000000002,-5.7779999999999995E-4,8.2529999999999996E-7,5.4339999999999999E-2,null,{"$f":"B8+C8*IDF!$B$5","v":2.8428391637141681},{"$f":"D8+2*E8*IDF!$B$5+F8*IDF!$B$5^2+G8","v":7.9735542792624681E-2},null,3.74]
["i60m",2.0720000000000001,1.2160000000000001E-3,0.51719999999999999,-7.0540000000000002E-4,1.0049999999999999E-6,7.3260000000000006E-2,null,{"$f":"B9+C9*IDF!$B$5","v":2.8417092183311121},{"$f":"D9+2*E9*IDF!$B$5+F9*IDF!$B$5^2+G9","v":0.10011818397140844},null,2.39]
["i3h",1.1970000000000001,2.4870000000000001E-3,0.63429999999999997,-8.7089999999999997E-4,1.238E-6,9.6589999999999995E-2,null,{"$f":"B10+C10*IDF!$B$5","v":2.7712325871623982},{"$f":"D10+2*E10*IDF!$B$5+F10*IDF!$B$5^2+G10","v":0.12438627740304335},null,1.19]
["i6h",6.1269999999999998E-2,4.1479999999999998E-3,0.77590000000000003,-1.07E-3,1.522E-6,0.13669999999999999,null,{"$f":"B11+C11*IDF!$B$5","v":2.6868899322676425},{"$f":"D11+2*E11*IDF!$B$5+F11*IDF!$B$5^2+G11","v":0.16783195053016381},null,0.753]
["i12h",-1.19,5.986E-3,0.72199999999999998,-9.8970000000000004E-4,1.407E-6,0.1183,null,{"$f":"B12+C12*IDF!$B$5","v":2.5990455435279913},{"$f":"D12+2*E12*IDF!$B$5+F12*IDF!$B$5^2+G12","v":0.15111228366650381},null,0.45300000000000001]
["i24h",-2.3260000000000001,7.5890000000000003E-3,0.66320000000000001,-9.0609999999999996E-4,1.288E-6,0.1028,null,{"$f":"B13+C13*IDF!$B$5","v":2.4777197844694165},{"$f":"D13+2*E13*IDF!$B$5+F13*IDF!$B$5^2+G13","v":0.13496763707767634},null,0.26700000000000002]
["i48h",-3.6629999999999998,9.5809999999999992E-3,0.48449999999999999,-6.5379999999999995E-4,9.3030000000000001E-7,5.6930000000000001E-2,null,{"$f":"B14+C14*IDF!$B$5","v":2.4016250171302507},{"$f":"D14+2*E14*IDF!$B$5+F14*IDF!$B$5^2+G14","v":8.648218236243152E-2},null,0.16]
[]
[]
["MEAN"]
[]
["Variabel","b_0","b_1","V(b_0)","Cov","V(b_1)","Res.var.",null,"E(Mean)","V(Mean)"]
["i1m",5.3940000000000001,0,1.7299999999999999E-2,0,0,0.16270000000000001,null,{"$f":"B20+C20*IDF!$B$6","v":5.3940000000000001},{"$f":"D20+2*E20*IDF!$B$6+F20*IDF!$B$6^2+G20","v":0.18000000000000002}]
{"$rows_left_out":28}
{"sheet":"help1","index":4,"n_rows":27,"n_cols":23,"rows_kept":27,"cut":false,"hidden":true,"merged":[]}
["Variable","i1m",null,"i2m",null,"i5m",null,"i10m",null,"i30m",null,"i60m",null,"i3h",null,"i6h",null,"i12h",null,"i24h",null,"i48h"]
[]
["q0",{"$f":"Tables!$L$4","v":16.7},null,{"$f":"Tables!$L$5","v":14.9},null,{"$f":"Tables!$L$6","v":10.6},null,{"$f":"Tables!$L$7","v":7.34},null,{"$f":"Tables!$L$8","v":3.74},null,{"$f":"Tables!$L$9","v":2.39},null,{"$f":"Tables!$L$10","v":1.19},null,{"$f":"Tables!$L$11","v":0.753},null,{"$f":"Tables!$L$12","v":0.45300000000000001},null,{"$f":"Tables!$L$13","v":0.26700000000000002},null,{"$f":"Tables!$L$14","v":0.16}]
["lambda",{"$f":"Tables!$I$4","v":4.1333203815367066},null,{"$f":"Tables!$I$5","v":3.0788239678567049},null,{"$f":"Tables!$I$6","v":2.9685775796256268},null,{"$f":"Tables!$I$7","v":2.8725360247051057},null,{"$f":"Tables!$I$8","v":2.8428391637141681},null,{"$f":"Tables!$I$9","v":2.8417092183311121},null,{"$f":"Tables!$I$10","v":2.7712325871623982},null,{"$f":"Tables!$I$11","v":2.6868899322676425},null,{"$f":"Tables!$I$12","v":2.5990455435279913},null,{"$f":"Tables!$I$13","v":2.4777197844694165},null,{"$f":"Tables!$I$14","v":2.4016250171302507}]
["mean",{"$f":"Tables!$I$20","v":5.3940000000000001},null,{"$f":"Tables!I21","v":5.6879999999999997},null,{"$f":"Tables!I22","v":4.7910000000000004},null,{"$f":"Tables!I23","v":3.8769999999999998},null,{"$f":"Tables!I24","v":1.9510000000000001},null,{"$f":"Tables!I25","v":1.163},null,{"$f":"Tables!I26","v":0.51472189594691553},null,{"$f":"Tables!I27","v":0.30848274818120314},null,{"$f":"Tables!I28","v":0.18956277108786121},null,{"$f":"Tables!I29","v":0.11492944940840411},null,{"$f":"Tables!I30","v":6.576671430777746E-2}]
["kappa",{"$f":"Tables!$E$37","v":-0.38761689777491126},null,{"$f":"Tables!$E$38","v":-0.22883457314913214},null,{"$f":"Tables!$E$39","v":-0.16007359705611779},null,{"$f":"Tables!$E$40","v":-5.5609566400933286E-2},null,{"$f":"Tables!$E$41","v":-0.15430047988187501},null,{"$f":"Tables!$E$42","v":-0.15498154981549828},null,{"$f":"Tables!$E$43","v":-0.14746202297147071},null,{"$f":"Tables!$E$44","v":-0.15088757396449681},null,{"$f":"Tables!$E$45","v":-0.14677538917716815},null,{"$f":"Tables!$E$46","v":-0.12628817687839589},null,{"$f":"Tables!$E$47","v":-7.2474942174248325E-2}]
["V_lambda",{"$f":"Tables!$J$4","v":0.29593369244721229},null,{"$f":"Tables!$J$5","v":9.9463269820846342E-2},null,{"$f":"Tables!$J$6","v":8.53783043892061E-2},null,{"$f":"Tables!$J$7","v":0.10247821644330322},null,{"$f":"Tables!$J$8","v":7.9735542792624681E-2},null,{"$f":"Tables!$J$9","v":0.10011818397140844},null,{"$f":"Tables!$J$10","v":0.12438627740304335},null,{"$f":"Tables!$J$11","v":0.16783195053016381},null,{"$f":"Tables!$J$12","v":0.15111228366650381},null,{"$f":"Tables!$J$13","v":0.13496763707767634},null,{"$f":"Tables!$J$14","v":8.648218236243152E-2}]
["V_mean",{"$f":"Tables!$J$20","v":0.18000000000000002},null,{"$f":"Tables!J21","v":0.18903},null,{"$f":"Tables!J22","v":8.2559999999999995E-2},null,{"$f":"Tables!J23","v":1.7673000000000001E-2},null,{"$f":"Tables!J24","v":1.3122E-2},null,{"$f":"Tables!J25","v":8.0800000000000004E-3},null,{"$f":"Tables!J26","v":1.7332568685465637E-3},null,{"$f":"Tables!J27","v":4.3521705981024406E-4},null,{"$f":"Tables!J28","v":1.1046221458483376E-4},null,{"$f":"Tables!J29","v":7.9618862192594442E-5},null,{"$f":"Tables!J30","v":2.8182269539716226E-5}]
["V_kappa",{"$f":"Tables!$G$37","v":1.4038136110986709E-3},null,{"$f":"Tables!$G$38","v":1.8127008175339125E-4},null,{"$f":"Tables!$G$39","v":2.334494393717262E-4},null,{"$f":"Tables!$G$40","v":3.0987973834140802E-4},null,{"$f":"Tables!$G$41","v":4.7441114641346201E-3},null,{"$f":"Tables!$G$42","v":4.5644539998475264E-3},null,{"$f":"Tables!$G$43","v":6.0738716519302344E-3},null,{"$f":"Tables!$G$44","v":4.7477326760208931E-4},null,{"$f":"Tables!$G$45","v":1.2314385207223388E-3},null,{"$f":"Tables!$G$46","v":6.1887282090410253E-4},null,{"$f":"Tables!$G$47","v":1.852476239110656E-3}]
[]
["Min Lanbda",null,{"$f":"MIN(B4:V4)","v":2.4016250171302507}]
[]
["T","z_T","S(z_T)","z_T","S(z_T)","z_T","S(z_T)","z_T","S(z_T)","z_T","S(z_T)","z_T","S(z_T)","z_T","S(z_T)","z_T","S(z_T)","z_T","S(z_T)","z_T","S(z_T)","z_T","S(z_T)"]
[{"$f":"IDF!B8","v":5},{"$f":"B$5*(1+B$6)/B$6*(1-(1/($A14*B$4))^B$6)+B$3","v":35.74281467702275},{"$f":"SQRT(((1+B$6)*B$5*$A14*(B$4*$A14)^(-B$6-1))^2*B$7+((1+B$6)/B$6*(1-(1/($A14*B$4))^B$6))^2*B$8+((1+B$6)*B$5*((B$4*$A14)^(-B$6)/B$6*LN(B$4*$A14)-1/B$6^2*(1-(B$4*$A14)^(-B$6))))^2*B$9)","v":2.4243494125562184},{"$f":"D$5*(1+D$6)/D$6*(1-(1/($A14*D$4))^D$6)+D$3","v":31.565455425213671},{"$f":"SQRT(((1+D$6)*D$5*$A14*(D$4*$A14)^(-D$6-1))^2*D$7+((1+D$6)/D$6*(1-(1/($A14*D$4))^D$6))^2*D$8+((1+D$6)*D$5*((D$4*$A14)^(-D$6)/D$6*LN(D$4*$A14)-1/D$6^2*(1-(D$4*$A14)^(-D$6))))^2*D$9)","v":1.5629627168561984},{"$f":"F$5*(1+F$6)/F$6*(1-(1/($A14*F$4))^F$6)+F$3","v":24.175803473651804},{"$f":"SQRT(((1+F$6)*F$5*$A14*(F$4*$A14)^(-F$6-1))^2*F$7+((1+F$6)/F$6*(1-(1/($A14*F$4))^F$6))^2*F$8+((1+F$6)*F$5*((F$4*$A14)^(-F$6)/F$6*LN(F$4*$A14)-1/F$6^2*(1-(F$4*$A14)^(-F$6))))^2*F$9)","v":1.0606085220232371},{"$f":"H$5*(1+H$6)/H$6*(1-(1/($A14*H$4))^H$6)+H$3","v":17.856197830394834},{"$f":"SQRT(((1+H$6)*H$5*$A14*(H$4*$A14)^(-H$6-1))^2*H$7+((1+H$6)/H$6*(1-(1/($A14*H$4))^H$6))^2*H$8+((1+H$6)*H$5*((H$4*$A14)^(-H$6)/H$6*LN(H$4*$A14)-1/H$6^2*(1-(H$4*$A14)^(-H$6))))^2*H$9)","v":0.64639323712167951},{"$f":"J$5*(1+J$6)/J$6*(1-(1/($A14*J$4))^J$6)+J$3","v":9.152245808161652},{"$f":"SQRT(((1+J$6)*J$5*$A14*(J$4*$A14)^(-J$6-1))^2*J$7+((1+J$6)/J$6*(1-(1/($A14*J$4))^J$6))^2*J$8+((1+J$6)*J$5*((J$4*$A14)^(-J$6)/J$6*LN(J$4*$A14)-1/J$6^2*(1-(J$4*$A14)^(-J$6))))^2*J$9)","v":0.66416788568460761},{"$f":"L$5*(1+L$6)/L$6*(1-(1/($A14*L$4))^L$6)+L$3","v":5.616190731732436},{"$f":"SQRT(((1+L$6)*L$5*$A14*(L$4*$A14)^(-L$6-1))^2*L$7+((1+L$6)/L$6*(1-(1/($A14*L$4))^L$6))^2*L$8+((1+L$6)*L$5*((L$4*$A14)^(-L$6)/L$6*LN(L$4*$A14)-1/L$6^2*(1-(L$4*$A14)^(-L$6))))^2*L$9)","v":0.43001264320022736},{"$f":"N$5*(1+N$6)/N$6*(1-(1/($A14*N$4))^N$6)+N$3","v":2.5990375725533186},{"$f":"SQRT(((1+N$6)*N$5*$A14*(N$4*$A14)^(-N$6-1))^2*N$7+((1+N$6)/N$6*(1-(1/($A14*N$4))^N$6))^2*N$8+((1+N$6)*N$5*((N$4*$A14)^(-N$6)/N$6*LN(N$4*$A14)-1/N$6^2*(1-(N$4*$A14)^(-N$6))))^2*N$9)","v":0.20824146161637164},{"$f":"P$5*(1+P$6)/P$6*(1-(1/($A14*P$4))^P$6)+P$3","v":1.5861045184254268},{"$f":"SQRT(((1+P$6)*P$5*$A14*(P$4*$A14)^(-P$6-1))^2*P$7+((1+P$6)/P$6*(1-(1/($A14*P$4))^P$6))^2*P$8+((1+P$6)*P$5*((P$4*$A14)^(-P$6)/P$6*LN(P$4*$A14)-1/P$6^2*(1-(P$4*$A14)^(-P$6))))^2*P$9)","v":8.5430331083946695E-2},{"$f":"R$5*(1+R$6)/R$6*(1-(1/($A14*R$4))^R$6)+R$3","v":0.9566536963929031},{"$f":"SQRT(((1+R$6)*R$5*$A14*(R$4*$A14)^(-R$6-1))^2*R$7+((1+R$6)/R$6*(1-(1/($A14*R$4))^R$6))^2*R$8+((1+R$6)*R$5*((R$4*$A14)^(-R$6)/R$6*LN(R$4*$A14)-1/R$6^2*(1-(R$4*$A14)^(-R$6))))^2*R$9)","v":5.1010811147466695E-2},{"$f":"T$5*(1+T$6)/T$6*(1-(1/($A14*T$4))^T$6)+T$3","v":0.56450112334663083},{"$f":"SQRT(((1+T$6)*T$5*$A14*(T$4*$A14)^(-T$6-1))^2*T$7+((1+T$6)/T$6*(1-(1/($A14*T$4))^T$6))^2*T$8+((1+T$6)*T$5*((T$4*$A14)^(-T$6)/T$6*LN(T$4*$A14)-1/T$6^2*(1-(T$4*$A14)^(-T$6))))^2*T$9)","v":3.2376634047792889E-2},{"$f":"V$5*(1+V$6)/V$6*(1-(1/($A14*V$4))^V$6)+V$3","v":0.32613635378856431},{"$f":"SQRT(((1+V$6)*V$5*$A14*(V$4*$A14)^(-V$6-1))^2*V$7+((1+V$6)/V$6*(1-(1/($A14*V$4))^V$6))^2*V$8+((1+V$6)*V$5*((V$4*$A14)^(-V$6)/V$6*LN(V$4*$A14)-1/V$6^2*(1-(V$4*$A14)^(-V$6))))^2*V$9)","v":1.8536964480259967E-2}]
[]
["Dur(min)","z_T","S_T"]
[1,{"$f":"B14","v":35.74281467702275},{"$f":"C14","v":2.4243494125562184}]
[2,{"$f":"D14","v":31.565455425213671},{"$f":"E14","v":1.5629627168561984}]
[5,{"$f":"F14","v":24.175803473651804},{"$f":"G14","v":1.0606085220232371}]
[10,{"$f":"H14","v":17.856197830394834},{"$f":"I14","v":0.64639323712167951}]
{"$rows_left_out":8}
{"sheet":"help3","index":5,"n_rows":32,"n_cols":18,"rows_kept":32,"cut":false,"hidden":true,"merged":[]}
["Variable",null,"bv1","bv2",null,null,null,null,null,null,null,null,"LAMBDA"]
[]
["z0",null,{"$f":"Q4","v":17.8},{"$f":"Q5","v":6.26},null,null,null,null,null,null,null,null,"Variable","b_0","b_1",null,"z_0","E(lambda)"]
["lambda",null,{"$f":"R4","v":2.451942505335563},{"$f":"R5","v":2.8662852025137511},null,null,null,null,null,null,null,null,"bv1",-2.855,8.3840000000000008E-3,null,17.8,{"$f":"N4+O4*IDF!$B$5","v":2.451942505335563}]
["mean",null,{"$f":"Q10","v":11.6515898432206},{"$f":"Q11","v":4.9800000000000004},null,null,null,null,null,null,null,null,"bv2",1.9319999999999999,1.4760000000000001E-3,null,6.26,{"$f":"N5+O5*IDF!$B$5","v":2.8662852025137511}]
["kappa",null,{"$f":"O17","v":-0.16412704240866516},{"$f":"O18","v":-0.22127356812522248}]
[null,null,null,null,null,null,null,null,null,null,null,null,"MEAN"]
[]
[null,null,null,null,null,null,"Incl. koblede regn, f-faktor 0, s-faktor 1",null,null,null,null,null,"Variable","b_0","b_1",null,"E(mean)"]
["T =",{"$f":"IDF!B8","v":5},{"$f":"C$5*(1+C$6)/C$6*(1-(1/($B10*C$4))^C$6)+C$3","v":47.995619473952786},{"$f":"D$5*(1+D$6)/D$6*(1-(1/($B10*D$4))^D$6)+D$3","v":20.323295564282986},null,0.1,{"$f":"C10","v":47.995619473952786},null,null,null,null,null,"bv1",-11.01,0.80720000000000003,null,{"$f":"N10+O10*IDF!B6","v":11.6515898432206}]
[null,null,null,null,null,1,{"$f":"D10","v":20.323295564282986},null,null,null,null,null,"bv2",4.9800000000000004,0,null,{"$f":"N11+O11*IDF!B6","v":4.9800000000000004}]
[]
[null,null,null,null,null,null,null,null,null,null,null,null,"L-CV"]
[]
[null,null,null,null,null,null,null,null,null,null,null,null,null,null,"Kappa"]
[null,null,null,null,null,null,null,null,null,null,null,null,"Variable","mean","mean"]
[null,null,null,null,null,null,null,null,null,null,null,null,"bv1",0.54469999999999996,{"$f":"1/N17-2","v":-0.16412704240866516}]
[null,null,null,null,null,null,null,null,null,null,null,null,"bv2",0.56220000000000003,{"$f":"1/N18-2","v":-0.22127356812522248}]
[]
[]
{"$rows_left_out":12}